Target
Glucocorticoid receptor
Ligand
BDBM50354849
Substrate
Meas. Tech.
ChEMBL_1680909 (CHEMBL4031186)
IC50
0.044000±n/a nM
Citation
 Hemmerling, MNilsson, SEdman, KEirefelt, SRussell, WHendrickx, RJohnsson, EKärrman Mårdh, CBerger, MRehwinkel, HAbrahamsson, ADahmén, JEriksson, ARGabos, BHenriksson, KHossain, NIvanova, SJansson, AHJensen, TJJerre, AJohansson, HKlingstedt, TLepistö, MLindsjö, MMile, INikitidis, GSteele, JTehler, UWissler, LHansson, T Selective Nonsteroidal Glucocorticoid Receptor Modulators for the Inhaled Treatment of Pulmonary Diseases. J Med Chem 60:8591-8605 (2017)  
Target
Name:
Glucocorticoid receptor
Synonyms:
GCR_HUMAN GRL Glucocorticoid receptor (GRFP) Nuclear receptor subfamily 3 group C member 1
Type:
Enzyme
Mol. Mass.:
85656.87
Organism:
Homo sapiens (Human)
Description:
P04150
Residue:
777
  
Inhibitor
Name:
BDBM50354849
Synonyms:
CCI-18781 FLUTICASONE PROPIONATE Flovent Flovent diskus 250 Flovent hfa US10869929, Compound FLUTICASONE PROPIONATE
Type:
Small organic molecule
Emp. Form.:
C25H31F3O5S
Mol. Mass.:
500.571
SMILES:
CCC(=O)O[C@@]1([C@H](C)C[C@H]2[C@@H]3C[C@H](F)C4=CC(=O)C=C[C@]4(C)[C@@]3(F)[C@@H](O)C[C@]12C)C(=O)SCF
: