Target
Progesterone receptor
Ligand
BDBM50354850
Substrate
Meas. Tech.
ChEBML_1680922
IC50
28±n/a nM
Citation
 Hemmerling, MNilsson, SEdman, KEirefelt, SRussell, WHendrickx, RJohnsson, EKärrman Mårdh, CBerger, MRehwinkel, HAbrahamsson, ADahmén, JEriksson, ARGabos, BHenriksson, KHossain, NIvanova, SJansson, AHJensen, TJJerre, AJohansson, HKlingstedt, TLepistö, MLindsjö, MMile, INikitidis, GSteele, JTehler, UWissler, LHansson, T Selective Nonsteroidal Glucocorticoid Receptor Modulators for the Inhaled Treatment of Pulmonary Diseases. J Med Chem 60:8591-8605 (2017)  
Target
Name:
Progesterone receptor
Synonyms:
NR3C3 PGR PRGR_HUMAN | progesterone
Type:
Protein
Mol. Mass.:
98979.52
Organism:
Homo sapiens (Human)
Description:
P06401
Residue:
933
  
Inhibitor
Name:
BDBM50354850
Synonyms:
BUDESONIDE US11554172, Compound Budesonide | US11760775, Compound Budesonide
Type:
Small organic molecule
Emp. Form.:
C25H34O6
Mol. Mass.:
430.5339
SMILES:
CCCC1O[C@@H]2C[C@H]3[C@@H]4CCC5=CC(=O)C=C[C@]5(C)[C@H]4[C@@H](O)C[C@]3(C)[C@@]2(O1)C(=O)CO
: