Target
Acid-sensing ion channel 1
Ligand
BDBM50250131
Substrate
Meas. Tech.
ChEMBL_1680984 (CHEMBL4031261)
IC50
<10000000±n/a nM
Citation
 Lynagh, TRomero-Rojo, JLLund, CPless, SA Molecular Basis for Allosteric Inhibition of Acid-Sensing Ion Channel 1a by Ibuprofen. J Med Chem 60:8192-8200 (2017)  
Target
Name:
Acid-sensing ion channel 1
Synonyms:
ASIC1_RAT Acid-sensing ion channel 1 Asic1 Brain sodium channel 2
Type:
PROTEIN
Mol. Mass.:
59630.33
Organism:
Rattus norvegicus
Description:
ChEMBL_109766
Residue:
526
  
Inhibitor
Name:
BDBM50250131
Synonyms:
CHEMBL190275
Type:
Small organic molecule
Emp. Form.:
C10H12O2
Mol. Mass.:
164.2011
SMILES:
CC(C(O)=O)c1ccc(C)cc1
: