Target
Atypical chemokine receptor 3
Ligand
BDBM50250391
Substrate
Meas. Tech.
ChEMBL_1681650 (CHEMBL4031927)
Ki
20±n/a nM
Citation
 Boehm, MBeaumont, KJones, RKalgutkar, ASZhang, LAtkinson, KBai, GBrown, JAEng, HGoetz, GHHolder, BRKhunte, BLazzaro, SLimberakis, CRyu, SShapiro, MJTylaska, LYan, JTurner, RLeung, SSFRamaseshan, MPrice, DALiras, SJacobson, MPEarp, DJLokey, RSMathiowetz, AMMenhaji-Klotz, E Discovery of Potent and Orally Bioavailable Macrocyclic Peptide-Peptoid Hybrid CXCR7 Modulators. J Med Chem 60:9653-9663 (2017)  
Target
Name:
Atypical chemokine receptor 3
Synonyms:
ACKR3 C-X-C chemokine receptor type 7 CMKOR1 CXCR-7 Chemokine orphan receptor 1 G-protein coupled receptor RDC1 homolog RDC-1 | RDC1
Type:
Enzyme
Mol. Mass.:
41498.84
Organism:
Homo sapiens (Human)
Description:
P25106
Residue:
362
  
Inhibitor
Name:
BDBM50250391
Synonyms:
CHEMBL4064492
Type:
Small organic molecule
Emp. Form.:
C51H58N8O6S
Mol. Mass.:
911.121
SMILES:
CN1[C@@H](Cc2cscn2)C(=O)N[C@@H](Cc2cccnc2)C(=O)N2CCC[C@@H]2C(=O)N(CCCc2ccccc2)CC(=O)N[C@@H](CCCc2ccccc2)C(=O)N[C@H](Cc2ccccc2)C1=O
: