Target
L-lactate dehydrogenase A chain
Ligand
BDBM50250655
Substrate
Meas. Tech.
ChEMBL_1682052 (CHEMBL4032329)
IC50
9±n/a nM
Citation
 Rai, GBrimacombe, KRMott, BTUrban, DJHu, XYang, SMLee, TDCheff, DMKouznetsova, JBenavides, GAPohida, KKuenstner, EJLuci, DKLukacs, CMDavies, DRDranow, DMZhu, HSulikowski, GMoore, WJStott, GMFlint, AJHall, MDDarley-Usmar, VMNeckers, LMDang, CVWaterson, AGSimeonov, AJadhav, AMaloney, DJ Discovery and Optimization of Potent, Cell-Active Pyrazole-Based Inhibitors of Lactate Dehydrogenase (LDH). J Med Chem 60:9184-9204 (2017)  
Target
Name:
L-lactate dehydrogenase A chain
Synonyms:
Cell proliferation-inducing gene 19 protein L-lactate dehydrogenase A Chain LDH-A LDHA Lactate dehydrogenase A (LDHA) | Renal carcinoma antigen NY-REN-59
Type:
Protein
Mol. Mass.:
36694.85
Organism:
Homo sapiens (Human)
Description:
P00338::PDB Code: 4ajp
Residue:
332
  
Inhibitor
Name:
BDBM50250655
Synonyms:
CHEMBL4059985 US11247971, Cmpd ID 189
Type:
Small organic molecule
Emp. Form.:
C24H22N4O4S2
Mol. Mass.:
494.586
SMILES:
NS(=O)(=O)c1ccc(Cc2c(CC3CC3)n(nc2-c2ccccc2)-c2nc(cs2)C(O)=O)cc1
: