Target
Glycylpeptide N-tetradecanoyltransferase 1
Ligand
BDBM50364113
Substrate
Meas. Tech.
ChEBML_1682157
IC50
4.0±n/a nM
Citation
 Bayliss, TRobinson, DASmith, VCBrand, SMcElroy, SPTorrie, LSMpamhanga, CNorval, SStojanovski, LBrenk, RFrearson, JARead, KDGilbert, IHWyatt, PG Design and Synthesis of Brain Penetrant Trypanocidal N-Myristoyltransferase Inhibitors. J Med Chem 60:9790-9806 (2017)  
Target
Name:
Glycylpeptide N-tetradecanoyltransferase 1
Synonyms:
Myristoyl-CoA:protein N-myristoyltransferase (Nmt) NMT NMT1_HUMAN Peptide N-myristoyltransferase 1
Type:
Enzyme
Mol. Mass.:
56814.10
Organism:
Homo sapiens (Human)
Description:
P30419
Residue:
496
  
Inhibitor
Name:
BDBM50364113
Synonyms:
CHEMBL1230468
Type:
Small organic molecule
Emp. Form.:
C21H24Cl2N6O2S
Mol. Mass.:
495.425
SMILES:
Cc1nn(C)c(C)c1NS(=O)(=O)c1c(Cl)cc(cc1Cl)-c1ccnc(c1)N1CCNCC1
: