Target
Glycylpeptide N-tetradecanoyltransferase 1
Ligand
BDBM50033588
Substrate
Meas. Tech.
ChEBML_1682157
IC50
12±n/a nM
Citation
 Bayliss, TRobinson, DASmith, VCBrand, SMcElroy, SPTorrie, LSMpamhanga, CNorval, SStojanovski, LBrenk, RFrearson, JARead, KDGilbert, IHWyatt, PG Design and Synthesis of Brain Penetrant Trypanocidal N-Myristoyltransferase Inhibitors. J Med Chem 60:9790-9806 (2017)  
Target
Name:
Glycylpeptide N-tetradecanoyltransferase 1
Synonyms:
Myristoyl-CoA:protein N-myristoyltransferase (Nmt) NMT NMT1_HUMAN Peptide N-myristoyltransferase 1
Type:
Enzyme
Mol. Mass.:
56814.10
Organism:
Homo sapiens (Human)
Description:
P30419
Residue:
496
  
Inhibitor
Name:
BDBM50033588
Synonyms:
CHEMBL3358114
Type:
Small organic molecule
Emp. Form.:
C22H30Cl2F2N4O2S
Mol. Mass.:
523.467
SMILES:
CN1CCC(CCCc2cc(Cl)c(c(Cl)c2)S(=O)(=O)N(C(F)F)c2c(C)nn(C)c2C)CC1
: