Target
Fatty-acid amide hydrolase 1
Ligand
BDBM50250852
Substrate
Meas. Tech.
ChEBML_1682355
IC50
0.160000±n/a nM
Citation
 Butler, CRBeck, EMHarris, AHuang, ZMcAllister, LAAm Ende, CWFennell, KFoley, TLFonseca, KHawrylik, SJJohnson, DSKnafels, JDMente, SNoell, GSPandit, JPhillips, TBPiro, JRRogers, BNSamad, TAWang, JWan, SBrodney, MA Azetidine and Piperidine Carbamates as Efficient, Covalent Inhibitors of Monoacylglycerol Lipase. J Med Chem 60:9860-9873 (2017)  
Target
Name:
Fatty-acid amide hydrolase 1
Synonyms:
Anandamide amidohydrolase FAAH FAAH1_HUMAN Fatty-acid amide hydrolase (FAAH) Oleamide hydrolase 1
Type:
Protein
Mol. Mass.:
63071.19
Organism:
Homo sapiens (Human)
Description:
O00519
Residue:
579
  
Inhibitor
Name:
BDBM50250852
Synonyms:
CHEMBL4078217
Type:
Small organic molecule
Emp. Form.:
C17H15F6N3O2
Mol. Mass.:
407.3103
SMILES:
FC(F)(F)C(OC(=O)N1CC(C1)c1ccn(Cc2ccccc2)n1)C(F)(F)F
: