Target
Aldo-keto reductase family 1 member B1
Ligand
BDBM16314
Substrate
Meas. Tech.
ChEBML_1683724
IC50
50±n/a nM
Citation
 Nencetti, SLa Motta, CRossello, ASartini, SNuti, ECiccone, LOrlandini, E N-(Aroyl)-N-(arylmethyloxy)-?-alanines: Selective inhibitors of aldose reductase. Bioorg Med Chem 25:3068-3076 (2017)  
Target
Name:
Aldo-keto reductase family 1 member B1
Synonyms:
ALDR_RAT Akr1b4 Aldr1
Type:
PROTEIN
Mol. Mass.:
35797.87
Organism:
Rattus norvegicus
Description:
ChEMBL_1512484
Residue:
316
  
Inhibitor
Name:
BDBM16314
Synonyms:
2-{[6-methoxy-5-(trifluoromethyl)naphthalen-1-yl]-N-methylmethanethioamido}acetic acid CHEMBL436 Tolrestat
Type:
Small organic molecule
Emp. Form.:
C16H14F3NO3S
Mol. Mass.:
357.347
SMILES:
COc1ccc2c(cccc2c1C(F)(F)F)C(=S)N(C)CC(O)=O
: