Target
Bromodomain-containing protein 7
Ligand
BDBM50256397
Substrate
Meas. Tech.
ChEBML_1687833
IC50
>1000±n/a nM
Citation
 Hasvold, LASheppard, GSWang, LFidanze, SDLiu, DPratt, JKMantei, RAWada, CKHubbard, RShen, YLin, XHuang, XWarder, SEWilcox, DLi, LBuchanan, FGSmithee, LAlbert, DHMagoc, TJPark, CHPetros, AMPanchal, SCSun, CKovar, PSoni, NBElmore, SWKati, WMMcDaniel, KF Methylpyrrole inhibitors of BET bromodomains. Bioorg Med Chem Lett 27:2225-2233 (2017)  
Target
Name:
Bromodomain-containing protein 7
Synonyms:
75 kDa bromodomain protein BRD7 CELTIX1 | Protein CELTIX-1
Type:
PROTEIN
Mol. Mass.:
74135.71
Organism:
Homo sapiens (Human)
Description:
ChEMBL_107970
Residue:
651
  
Inhibitor
Name:
BDBM50256397
Synonyms:
CHEMBL4088466
Type:
Small organic molecule
Emp. Form.:
C21H16F2N2O4S
Mol. Mass.:
430.425
SMILES:
Cn1cc(-c2cc(ccc2Oc2ccc(F)cc2F)S(C)(=O)=O)c2cc[nH]c(=O)c12
: