Target
Cytochrome P450 2C9
Ligand
BDBM50257164
Substrate
Meas. Tech.
ChEBML_1689563
IC50
37±n/a nM
Citation
 Swain, NABatchelor, DBeaudoin, SBechle, BMBradley, PABrown, ADBrown, BButcher, KJButt, RPChapman, MLDenton, SEllis, DGalan, SRGGaulier, SMGreener, BSde Groot, MJGlossop, MSGurrell, IKHannam, JJohnson, MSLin, ZMarkworth, CJMarron, BEMillan, DSNakagawa, SPike, APrintzenhoff, DRawson, DJRansley, SJReister, SMSasaki, KStorer, RIStupple, PAWest, CW Discovery of Clinical Candidate 4-[2-(5-Amino-1H-pyrazol-4-yl)-4-chlorophenoxy]-5-chloro-2-fluoro-N-1,3-thiazol-4-ylbenzenesulfonamide (PF-05089771): Design and Optimization of Diaryl Ether Aryl Sulfonamides as Selective Inhibitors of Na J Med Chem 60:7029-7042 (2017)  
Target
Name:
Cytochrome P450 2C9
Synonyms:
(R)-limonene 6-monooxygenase CP2C9_HUMAN CYP2C9 Cytochrome P450 2C9 (CYP2C9 ) P-450MP P450 PB-1 | S-mephenytoin 4-hydroxylase
Type:
Enzyme
Mol. Mass.:
55636.33
Organism:
Homo sapiens (Human)
Description:
P11712
Residue:
490
  
Inhibitor
Name:
BDBM50257164
Synonyms:
CHEMBL2324405
Type:
Small organic molecule
Emp. Form.:
C19H13Cl2FN4O3S2
Mol. Mass.:
499.366
SMILES:
Cn1nccc1-c1cc(Cl)ccc1Oc1cc(F)c(cc1Cl)S(=O)(=O)Nc1cscn1
: