Target
Potassium voltage-gated channel subfamily H member 2
Ligand
BDBM50325744
Substrate
Meas. Tech.
ChEMBL_1691279 (CHEMBL4041928)
Ki
10±n/a nM
Citation
 Levoin, NLabeeuw, OBillot, XCalmels, TDanvy, DKrief, SBerrebi-Bertrand, ILecomte, JMSchwartz, JCCapet, M Discovery of nanomolar ligands with novel scaffolds for the histamine H4 receptor by virtual screening. Eur J Med Chem 125:565-572 (2017)  
Target
Name:
Potassium voltage-gated channel subfamily H member 2
Synonyms:
1,3-beta-glucan synthase component GLS2 ERG Eag-related protein 1 Ether-a-go-go-related gene (HERG) Ether-a-go-go-related gene potassium channel 1 Ether-a-go-go-related gene potassium channel 1 (hERG1) Ether-a-go-go-related protein 1 H-ERG KCNH2 Potassium voltage-gated channel subfamily H member 2 (hERG) Voltage-gated potassium channel subunit Kv11.1 hERG Potassium Channel 1 | putative potassium channel subunit
Type:
Multi-pass membrane protein
Mol. Mass.:
126672.65
Organism:
Homo sapiens (Human)
Description:
Q12809
Residue:
1159
  
Inhibitor
Name:
BDBM50325744
Synonyms:
CHEMBL1223683 | N-(4-(4-(2,3-dichlorophenyl)piperazin-1-yl)butyl)quinolin-2-amine
Type:
Small organic molecule
Emp. Form.:
C23H26Cl2N4
Mol. Mass.:
429.385
SMILES:
Clc1cccc(N2CCN(CCCCNc3ccc4ccccc4n3)CC2)c1Cl
: