Target
Histamine H4 receptor
Ligand
BDBM50259294
Substrate
Meas. Tech.
ChEBML_1691281
Ki
3018±n/a nM
Citation
 Levoin, NLabeeuw, OBillot, XCalmels, TDanvy, DKrief, SBerrebi-Bertrand, ILecomte, JMSchwartz, JCCapet, M Discovery of nanomolar ligands with novel scaffolds for the histamine H4 receptor by virtual screening. Eur J Med Chem 125:565-572 (2017)  
Target
Name:
Histamine H4 receptor
Synonyms:
AXOR35 GPCR105 HH4R HRH4 Histamine H4 receptor Histamine receptor (H3 and H4) SP9144
Type:
G Protein-Coupled Receptor (GPCR)
Mol. Mass.:
44517.02
Organism:
Homo sapiens (Human)
Description:
Binding assays were using CHO cells stably expressing hH4R receptors.
Residue:
390
  
Inhibitor
Name:
BDBM50259294
Synonyms:
CHEMBL4061504
Type:
Small organic molecule
Emp. Form.:
C24H27N3O6
Mol. Mass.:
453.4877
SMILES:
[H][C@]1(Cc2ccccc2CN(CC(=O)OCC)C1=O)NC(=O)C(Cc1ccccc1)C(=O)NO
: