Target
Transmembrane domain-containing protein TMIGD3
Ligand
BDBM50259304
Substrate
Meas. Tech.
ChEBML_1691289
IC50
187±n/a nM
Citation
 Poli, DFalsini, MVarano, FBetti, MVarani, KVincenzi, FPugliese, AMPedata, FDal Ben, DThomas, APalchetti, IBettazzi, FCatarzi, DColotta, V Imidazo[1,2-a]pyrazin-8-amine core for the design of new adenosine receptor antagonists: Structural exploration to target the A Eur J Med Chem 125:611-628 (2017)  
Target
Name:
Transmembrane domain-containing protein TMIGD3
Synonyms:
TMIG3_HUMAN Transmembrane domain-containing protein TMIGD3
Type:
PROTEIN
Mol. Mass.:
30335.79
Organism:
Homo sapiens (Human)
Description:
ChEMBL_114868
Residue:
266
  
Inhibitor
Name:
BDBM50259304
Synonyms:
CHEMBL4070079
Type:
Small organic molecule
Emp. Form.:
C26H18N4O2
Mol. Mass.:
418.4467
SMILES:
O=C(N(C(=O)c1ccccc1)c1nccn2cc(nc12)-c1ccccc1)c1ccccc1
: