Target
Proteasome subunit beta type-1
Ligand
BDBM50069989
Substrate
Meas. Tech.
ChEBML_1691540
IC50
30±n/a nM
Citation
 Han, LQYuan, XWu, XYLi, RDXu, BCheng, QLiu, ZMZhou, TYAn, HYWang, XCheng, TMGe, ZMCui, JRLi, RT Urea-containing peptide boronic acids as potent proteasome inhibitors. Eur J Med Chem 125:925-939 (2017)  
Target
Name:
Proteasome subunit beta type-1
Synonyms:
PSB1_HUMAN PSMB1 Proteasome subunit beta type-1/beta type-5
Type:
PROTEIN
Mol. Mass.:
26493.62
Organism:
Homo sapiens (Human)
Description:
ChEMBL_1366691
Residue:
241
  
Inhibitor
Name:
BDBM50069989
Synonyms:
(R)-3-methyl-1-((S)-3-phenyl-2-(pyrazine-2-carboxamido)propanamido)butylboronic acid BORTEZOMIB Dipeptidyl boronic acid derivative N-[(1R)-1-(DIHYDROXYBORYL)-3-METHYLBUTYL]-N-(PYRAZIN-2-YLCARBONYL)-L-PHENYLALANINAMIDE Peptidyl boronic acid derivative Velcade | cid_387447
Type:
Small organic molecule
Emp. Form.:
C19H25BN4O4
Mol. Mass.:
384.237
SMILES:
CC(C)C[C@H](NC(=O)[C@H](Cc1ccccc1)NC(=O)c1cnccn1)B(O)O
: