Target
Beta-secretase 1
Ligand
BDBM50259973
Substrate
Meas. Tech.
ChEMBL_1692055 (CHEMBL4042704)
IC50
18±n/a nM
Citation
 Butler, CROgilvie, KMartinez-Alsina, LBarreiro, GBeck, EMNolan, CEAtchison, KBenvenuti, EBuzon, LDoran, SGonzales, CHelal, CJHou, XHsu, MHJohnson, EFLapham, KLanyon, LParris, KO'Neill, BTRiddell, DRobshaw, AVajdos, FBrodney, MA Aminomethyl-Derived Beta Secretase (BACE1) Inhibitors: Engaging Gly230 without an Anilide Functionality. J Med Chem 60:386-402 (2017)  
Target
Name:
Beta-secretase 1
Synonyms:
ASP2 Aspartyl protease 2 BACE1 Beta-secretase (BACE) Beta-secretase 1 (BACE 1) Beta-secretase 1 (BACE1) Beta-site amyloid precursor protein cleaving enzyme 1 Memapsin-2 beta-Secretase (BACE-1) | beta-Secretase (BACE1)
Type:
Protein
Mol. Mass.:
55755.10
Organism:
Homo sapiens (Human)
Description:
P56817
Residue:
501
  
Inhibitor
Name:
BDBM50259973
Synonyms:
CHEMBL4098403
Type:
Small organic molecule
Emp. Form.:
C16H18F5N3S
Mol. Mass.:
379.391
SMILES:
C[C@]1(CCSC(N)=N1)c1cc(CNC2(CC2)C(F)(F)F)c(F)cc1F
: