Target
Rhodopsin kinase GRK1
Ligand
BDBM50260147
Substrate
Meas. Tech.
ChEBML_1692745
IC50
25800±n/a nM
Citation
 Waldschmidt, HVHoman, KTCato, MCCruz-Rodríguez, OCannavo, AWilson, MWSong, JCheung, JYKoch, WJTesmer, JJLarsen, SD Structure-Based Design of Highly Selective and Potent G Protein-Coupled Receptor Kinase 2 Inhibitors Based on Paroxetine. J Med Chem 60:3052-3069 (2017)  
Target
Name:
Rhodopsin kinase GRK1
Synonyms:
G protein-coupled receptor kinase 1 GRK1_BOVIN Rhodopsin kinase
Type:
PROTEIN
Mol. Mass.:
62931.24
Organism:
Bos taurus
Description:
ChEMBL_116985
Residue:
561
  
Inhibitor
Name:
BDBM50260147
Synonyms:
CHEMBL4063014
Type:
Small organic molecule
Emp. Form.:
C27H25Cl2FN2O4
Mol. Mass.:
531.403
SMILES:
Fc1ccc(cc1C(=O)NCc1c(Cl)cccc1Cl)[C@@H]1CCNC[C@H]1COc1ccc2OCOc2c1
: