Target
Alpha-galactosidase
Ligand
BDBM50260444
Substrate
Meas. Tech.
ChEMBL_1693828 (CHEMBL4044718)
IC50
16±n/a nM
Citation
 Gavale, KSChavan, SRKumbhar, NKawade, SDoshi, PKhan, ADhavale, DD ?-Geminal disubstituted pyrrolidine iminosugars and their C-4-fluoro analogues: Synthesis, glycosidase inhibition and molecular docking studies. Bioorg Med Chem 25:5148-5159 (2017)  
Target
Name:
Alpha-galactosidase
Synonyms:
α-galactosidase Alpha-galactosidase
Type:
Protein
Mol. Mass.:
41306.82
Organism:
Coffea arabica (Coffee beans)
Description:
Residue:
378
  
Inhibitor
Name:
BDBM50260444
Synonyms:
CHEMBL4073111
Type:
Small organic molecule
Emp. Form.:
C6H13NO4
Mol. Mass.:
163.1717
SMILES:
OCC1(CO)NC[C@@H](O)[C@H]1O
: