Target
Beta-galactosidase
Ligand
BDBM50261421
Substrate
Meas. Tech.
ChEBML_1696006
Ki
0.080000±n/a nM
Citation
 Pickens, JBWang, FStriegler, S Picomolar inhibition of?-galactosidase (bovine liver) attributed to loop closure. Bioorg Med Chem 25:5194-5202 (2017)  
Target
Name:
Beta-galactosidase
Synonyms:
β-galactosidase Beta-galactosidase/Glucosylceramidase | GLB1
Type:
Protein
Mol. Mass.:
73420.88
Organism:
Bos taurus (Bovine)
Description:
Residue:
653
  
Inhibitor
Name:
BDBM50261421
Synonyms:
CHEMBL3359681
Type:
Small organic molecule
Emp. Form.:
C13H24N2O4
Mol. Mass.:
272.3407
SMILES:
OC[C@H]1N\C(=N/CC2CCCCC2)[C@H](O)[C@@H](O)[C@H]1O
: