Target
D(1A)/D(2) dopamine receptor
Ligand
BDBM50010694
Substrate
Meas. Tech.
ChEMBL_59611 (CHEMBL670947)
Ki
162±n/a nM
Citation
 Gao, YGBaldessarini, RJKula, NSNeumeyer, JL Synthesis and dopamine receptor affinities of enantiomers of 2-substituted apomorphines and their N-n-propyl analogues. J Med Chem 33:1800-5 (1990)  
Target
Name:
D(1A)/D(2) dopamine receptor
Synonyms:
Dopamine receptor
Type:
Mol. Mass.:
Description:
ASSAY_ID of ChEMBL is 59578
Components:
This complex has 2 components.
Component 1
Name:
D(2) dopamine receptor
Synonyms:
DOPAMINE D2 DRD2_BOVIN | Dopamine D2 receptor
Type:
Enzyme Catalytic Domain
Mol. Mass.:
50698.79
Organism:
BOVINE
Description:
P20288
Residue:
444
  
Component 2
Name:
D(1A) dopamine receptor
Synonyms:
D(1A) dopamine receptor DOPAMINE D1 DRD1_BOVIN | Dopamine receptor
Type:
Enzyme Catalytic Domain
Mol. Mass.:
49330.65
Organism:
BOVINE
Description:
DOPAMINE D1 DRD1 BOVINE::Q95136
Residue:
446
  
Inhibitor
Name:
BDBM50010694
Synonyms:
2-Methoxy-6-methyl-5,6,6a,7-tetrahydro-4H-dibenzo[de,g]quinoline-10,11-diol | CHEMBL301761
Type:
Small organic molecule
Emp. Form.:
C18H19NO3
Mol. Mass.:
297.3484
SMILES:
COc1cc2CCN(C)[C@H]3Cc4ccc(O)c(O)c4-c(c1)c23
: