Target
17-beta-hydroxysteroid dehydrogenase type 1
Ligand
BDBM50266422
Substrate
Meas. Tech.
ChEMBL_1700821 (CHEMBL4051803)
IC50
2.7±n/a nM
Citation
 Salah, MAbdelsamie, ASFrotscher, M First Dual Inhibitors of Steroid Sulfatase (STS) and 17?-Hydroxysteroid Dehydrogenase Type 1 (17?-HSD1): Designed Multiple Ligands as Novel Potential Therapeutics for Estrogen-Dependent Diseases. J Med Chem 60:4086-4092 (2017)  
Target
Name:
17-beta-hydroxysteroid dehydrogenase type 1
Synonyms:
17-beta-HSD 1 17-beta-hydroxysteroid dehydrogenase type 1 20-alpha-HSD E17KSR EDH17B1 EDHB17 Estradiol 17-beta-dehydrogenase 1 (17beta-HSD1) Placental 17-beta-hydroxysteroid dehydrogenase | SDR28C1
Type:
Enzyme
Mol. Mass.:
34945.13
Organism:
Homo sapiens (Human)
Description:
P14061
Residue:
328
  
Inhibitor
Name:
BDBM50266422
Synonyms:
CHEMBL4099681
Type:
Small organic molecule
Emp. Form.:
C17H9F4NO5S2
Mol. Mass.:
447.381
SMILES:
NS(=O)(=O)Oc1ccc(-c2ccc(s2)C(=O)c2c(F)ccc(O)c2F)c(F)c1F
: