Target
ATPase family AAA domain-containing protein 2
Ligand
BDBM50157646
Substrate
Meas. Tech.
ChEMBL_1701778 (CHEMBL4053011)
IC50
>100000±n/a nM
Citation
 Igoe, NBayle, EDFedorov, OTallant, CSavitsky, PRogers, COwen, DRDeb, GSomervaille, TCAndrews, DMJones, NCheasty, ARyder, HBrennan, PEMüller, SKnapp, SFish, PV Design of a Biased Potent Small Molecule Inhibitor of the Bromodomain and PHD Finger-Containing (BRPF) Proteins Suitable for Cellular and in Vivo Studies. J Med Chem 60:668-680 (2017)  
Target
Name:
ATPase family AAA domain-containing protein 2
Synonyms:
AAA nuclear coregulator cancer-associated protein ATAD2 PRO2000
Type:
PROTEIN
Mol. Mass.:
158546.30
Organism:
Homo sapiens (Human)
Description:
ChEMBL_1500426
Residue:
1390
  
Inhibitor
Name:
BDBM50157646
Synonyms:
CHEMBL216146
Type:
Small organic molecule
Emp. Form.:
C10H9NO
Mol. Mass.:
159.1846
SMILES:
Cn1c2ccccc2ccc1=O
: