Target
Peregrin
Ligand
BDBM50157646
Substrate
Meas. Tech.
ChEMBL_1701767 (CHEMBL4053000)
IC50
4800±n/a nM
Citation
 Igoe, NBayle, EDFedorov, OTallant, CSavitsky, PRogers, COwen, DRDeb, GSomervaille, TCAndrews, DMJones, NCheasty, ARyder, HBrennan, PEMüller, SKnapp, SFish, PV Design of a Biased Potent Small Molecule Inhibitor of the Bromodomain and PHD Finger-Containing (BRPF) Proteins Suitable for Cellular and in Vivo Studies. J Med Chem 60:668-680 (2017)  
Target
Name:
Peregrin
Synonyms:
BR140 BRPF1_HUMAN Peregrin | Protein Br140
Type:
PROTEIN
Mol. Mass.:
137524.47
Organism:
Homo sapiens (Human)
Description:
ChEMBL_108054
Residue:
1214
  
Inhibitor
Name:
BDBM50157646
Synonyms:
CHEMBL216146
Type:
Small organic molecule
Emp. Form.:
C10H9NO
Mol. Mass.:
159.1846
SMILES:
Cn1c2ccccc2ccc1=O
: