Target
Aromatase
Ligand
BDBM9460
Substrate
Meas. Tech.
ChEMBL_36056 (CHEMBL645587)
IC50
1900±n/a nM
Citation
 Stanek, JAlder, ABellus, DBhatnagar, ASHäusler, ASchieweck, K Synthesis and aromatase inhibitory activity of novel 1-(4-aminophenyl)-3-azabicyclo[3.1.0]hexane- and -[3.1.1]heptane-2,4- diones. J Med Chem 34:1329-34 (1991)  
Target
Name:
Aromatase
Synonyms:
ARO1 CP19A_HUMAN CYP19 CYPXIX Cytochrome P450 19A1 Cytochrome P450-C19 (CYP19) FL cytokine receptor precursor | P-450AROM
Type:
Enzyme
Mol. Mass.:
57888.92
Organism:
Homo sapiens (Human)
Description:
P11511
Residue:
503
  
Inhibitor
Name:
BDBM9460
Synonyms:
3-(4-aminophenyl)-3-ethyl-piperidine-2,6-dione Aminoglutethimide AG, 4 Cytadren Elipten | aminoglutethimide (AG)
Type:
Small organic molecule
Emp. Form.:
C13H16N2O2
Mol. Mass.:
232.2783
SMILES:
CCC1(CCC(=O)NC1=O)c1ccc(N)cc1
: