Target
Metallo-beta-lactamase GIM-1
Ligand
BDBM50267418
Substrate
Meas. Tech.
ChEMBL_1702771 (CHEMBL4054004)
IC50
20000±n/a nM
Citation
 Skagseth, SAkhter, SPaulsen, MHMuhammad, ZLauksund, SSamuelsen, ØLeiros, HSBayer, A Metallo-?-lactamase inhibitors by bioisosteric replacement: Preparation, activity and binding. Eur J Med Chem 135:159-173 (2017)  
Target
Name:
Metallo-beta-lactamase GIM-1
Synonyms:
GIM-1 Metallo-beta-lactamase GIM-1
Type:
Enzyme Catalytic Domain
Mol. Mass.:
27418.35
Organism:
Pseudomonas aeruginosa
Description:
Residue:
250
  
Inhibitor
Name:
BDBM50267418
Synonyms:
CHEMBL4090938
Type:
Small organic molecule
Emp. Form.:
C14H21O4PS
Mol. Mass.:
316.353
SMILES:
CC(=O)SCC(CCCCc1ccccc1)P(O)(O)=O
: