Target
Histone-lysine N-methyltransferase EHMT1
Ligand
BDBM50268886
Substrate
Meas. Tech.
ChEMBL_1705438 (CHEMBL4056671)
IC50
5.0±n/a nM
Citation
 Xiong, YLi, FBabault, NWu, HDong, AZeng, HChen, XArrowsmith, CHBrown, PJLiu, JVedadi, MJin, J Structure-activity relationship studies of G9a-like protein (GLP) inhibitors. Bioorg Med Chem 25:4414-4423 (2017)  
Target
Name:
Histone-lysine N-methyltransferase EHMT1
Synonyms:
EHMT1 EUHMTASE1 Euchromatic histone-lysine N-methyltransferase 1 GLP H3-K9-HMTase 5 Histone-lysine N-methyltransferase EHMT1/EHMT2 KMT1D | Lysine N-methyltransferase 1D
Type:
PROTEIN
Mol. Mass.:
141443.67
Organism:
Homo sapiens (Human)
Description:
ChEMBL_1450367
Residue:
1298
  
Inhibitor
Name:
BDBM50268886
Synonyms:
CHEMBL4072211
Type:
Small organic molecule
Emp. Form.:
C20H31N5O2
Mol. Mass.:
373.4924
SMILES:
CCCN(C)c1nc(NC2CCN(C)CC2)c2cc(OC)c(OC)cc2n1
: