Target
Basic phospholipase A2 VRV-PL-VIIIa
Ligand
BDBM50269105
Substrate
Meas. Tech.
ChEMBL_1705594 (CHEMBL4056827)
IC50
21655±n/a nM
Citation
 Lokeshwari, DMAchutha, DKSrinivasan, BShivalingegowda, NKrishnappagowda, LNKariyappa, AK Synthesis of novel 2-pyrazoline analogues with potent anti-inflammatory effect mediated by inhibition of phospholipase A2: Crystallographic, in silico docking and QSAR analysis. Bioorg Med Chem Lett 27:3806-3811 (2017)  
Target
Name:
Basic phospholipase A2 VRV-PL-VIIIa
Synonyms:
3.1.1.4 DPLA2 PLA24 Phospholipase A2 4 | svPLA2
Type:
PROTEIN
Mol. Mass.:
13615.14
Organism:
Daboia russelii
Description:
ChEMBL_116772
Residue:
121
  
Inhibitor
Name:
BDBM50269105
Synonyms:
CHEMBL4061627
Type:
Small organic molecule
Emp. Form.:
C22H18Cl2N2
Mol. Mass.:
381.298
SMILES:
Cc1ccc(cc1)C1=NN(C(C1)c1cccc(Cl)c1Cl)c1ccccc1
: