Target
Chromatin remodeling regulator CECR2
Ligand
BDBM50269698
Substrate
Meas. Tech.
ChEMBL_1707032 (CHEMBL4058265)
IC50
83±n/a nM
Citation
 Crawford, TDAudia, JEBellon, SBurdick, DJBommi-Reddy, ACôté, ACummings, RTDuplessis, MFlynn, EMHewitt, MHuang, HRJayaram, HJiang, YJoshi, SKiefer, JRMurray, JNasveschuk, CGNeiss, APardo, ERomero, FASandy, PSims, RJTang, YTaylor, AMTsui, VWang, JWang, SWang, YXu, ZZawadzke, LZhu, XAlbrecht, BKMagnuson, SRCochran, AG GNE-886: A Potent and Selective Inhibitor of the Cat Eye Syndrome Chromosome Region Candidate 2 Bromodomain (CECR2). ACS Med Chem Lett 8:737-741 (2017)  
Target
Name:
Chromatin remodeling regulator CECR2
Synonyms:
CECR2 Cat eye syndrome critical region protein 2 | KIAA1740
Type:
PROTEIN
Mol. Mass.:
164223.89
Organism:
Homo sapiens (Human)
Description:
ChEMBL_107999
Residue:
1484
  
Inhibitor
Name:
BDBM50269698
Synonyms:
CHEMBL4093696
Type:
Small organic molecule
Emp. Form.:
C24H28N6O2
Mol. Mass.:
432.5181
SMILES:
CN(C1CCN(CC1)c1cc(ncn1)C1CC1)C(=O)c1cn(CC=C)c(=O)c2[nH]ccc12
: