Target
CREB-binding protein
Ligand
BDBM50269849
Substrate
Meas. Tech.
ChEMBL_1707367 (CHEMBL4058600)
IC50
1.1±n/a nM
Citation
 Romero, FAMurray, JLai, KWTsui, VAlbrecht, BKAn, LBeresini, MHde Leon Boenig, GBronner, SMChan, EWChen, KXChen, ZChoo, EFClagg, KClark, KCrawford, TDCyr, Pde Almeida Nagata, DGascoigne, KEGrogan, JLHatzivassiliou, GHuang, WHunsaker, TLKaufman, SKoenig, SGLi, RLi, YLiang, XLiao, JLiu, WLy, JMaher, JMasui, CMerchant, MRan, YTaylor, AMWai, JWang, FWei, XYu, DZhu, BYZhu, XMagnuson, S GNE-781, A Highly Advanced Potent and Selective Bromodomain Inhibitor of Cyclic Adenosine Monophosphate Response Element Binding Protein, Binding Protein (CBP). J Med Chem 60:9162-9183 (2017)  
Target
Name:
CREB-binding protein
Synonyms:
CBP CREB-binding protein (CBP) CREBBP
Type:
Transcription Coactivator
Mol. Mass.:
265411.66
Organism:
Homo sapiens (Human)
Description:
Q92793
Residue:
2442
  
Inhibitor
Name:
BDBM50269849
Synonyms:
CHEMBL4076748
Type:
Small organic molecule
Emp. Form.:
C27H32F2N6O2
Mol. Mass.:
510.5788
SMILES:
CC(=O)N1CCc2c(C1)c(nn2C1CCOCC1)N1CCCc2cc(-c3cnn(C)c3)c(cc12)C(F)F
: