Target
3-hydroxy-3-methylglutaryl-coenzyme A reductase
Ligand
BDBM50013216
Substrate
Meas. Tech.
ChEBML_80477
IC50
0.002000±n/a nM
Citation
 Jendralla, HBaader, EBartmann, WBeck, GBergmann, AGranzer, Evon Kerekjarto, BKesseler, KKrause, RSchubert, W Synthesis and biological activity of new HMG-CoA reductase inhibitors. 2. Derivatives of 7-(1H-pyrrol-3-yl)-substituted-3,5-dihydroxyhept-6(E)-enoic (-heptanoic) acids. J Med Chem 33:61-70 (1990)  
Target
Name:
3-hydroxy-3-methylglutaryl-coenzyme A reductase
Synonyms:
3-hydroxy-3-methylglutaryl-coenzyme A (HMG-CoA) reductase HMDH_HUMAN HMG-CoA reductase (HMGR) | HMGCR
Type:
Enzyme
Mol. Mass.:
97477.10
Organism:
Homo sapiens (Human)
Description:
P04035
Residue:
888
  
Inhibitor
Name:
BDBM50013216
Synonyms:
(racemic)Sodium salt of7-[4-(4-Fluoro-phenyl)-1,2-diisopropyl-1H-pyrrol-3-yl]-3,5-dihydroxy-heptanoic acid Sodium salt of7-[4-(4-Fluoro-phenyl)-1,2-diisopropyl-1H-pyrrol-3-yl]-3R,5R-dihydroxy-heptanoic acid
Type:
Small organic molecule
Emp. Form.:
C23H31FNO4
Mol. Mass.:
404.4955
SMILES:
CC(C)c1c(CC[C@@H](O)C[C@@H](O)CC([O-])=O)c(cn1C(C)C)-c1ccc(F)cc1
: