Target
Lysine-specific demethylase 5A
Ligand
BDBM50273478
Substrate
Meas. Tech.
ChEMBL_1712924 (CHEMBL4122973)
Ki
74000±n/a nM
Citation
 Bhushan, BErdmann, AZhang, YBelle, RJohannson, COppermann, UHopkinson, RJSchofield, CJKawamura, A Investigations on small molecule inhibitors targeting the histone H3K4 tri-methyllysine binding PHD-finger of JmjC histone demethylases. Bioorg Med Chem 26:2984-2991 (2018)  
Target
Name:
Lysine-specific demethylase 5A
Synonyms:
Histone demethylase JARID1A Jumonji/ARID domain-containing protein 1A KDM5A_HUMAN RBBP-2 RBP2 | Retinoblastoma-binding protein 2
Type:
Protein
Mol. Mass.:
192091.79
Organism:
Homo sapiens (Human)
Description:
P29375
Residue:
1690
  
Inhibitor
Name:
BDBM50273478
Synonyms:
CHEMBL4130224
Type:
Small organic molecule
Emp. Form.:
C25H32INO3
Mol. Mass.:
521.4309
SMILES:
[I-].CCCCc1oc2ccccc2c1C(=O)c1ccc(OCCC[N+](C)(C)C)cc1
: