Target
Proteasome subunit beta type-10
Ligand
BDBM50273999
Substrate
Meas. Tech.
ChEMBL_1713675 (CHEMBL4123724)
IC50
360±n/a nM
Citation
 Artschwager, RWard, DJGannon, SBrouwer, AJvan de Langemheen, HKowalski, HLiskamp, RMJ Potent and Highly Selective Inhibitors of the Proteasome Trypsin-like Site by Incorporation of Basic Side Chain Containing Amino Acid Derived Sulfonyl Fluorides. J Med Chem 61:5395-5411 (2018)  
Target
Name:
Proteasome subunit beta type-10
Synonyms:
LMP10 MECL1 Multicatalytic endopeptidase complex subunit MECl-1 PSMB10 Proteasome subunit beta-2i
Type:
PROTEIN
Mol. Mass.:
28940.51
Organism:
Homo sapiens (Human)
Description:
ChEMBL_106197
Residue:
273
  
Inhibitor
Name:
BDBM50273999
Synonyms:
CHEMBL4129702
Type:
Small organic molecule
Emp. Form.:
C31H46FN5O5S
Mol. Mass.:
619.791
SMILES:
CC(C)C[C@H](NC(=O)[C@@H](N)Cc1ccccc1)C(=O)N[C@@H](CC(C)C)C(=O)N[C@@H](Cc1ccc(CN)cc1)CS(F)(=O)=O
: