Target
Tubulin beta chain
Ligand
BDBM50014846
Substrate
Meas. Tech.
ChEMBL_1713861 (CHEMBL4123910)
IC50
6930±n/a nM
Citation
 Batran, RZKassem, AFAbbas, EMHElseginy, SAMounier, MM Design, synthesis and molecular modeling of new 4-phenylcoumarin derivatives as tubulin polymerization inhibitors targeting MCF-7 breast cancer cells. Bioorg Med Chem 26:3474-3490 (2018)  
Target
Name:
Tubulin beta chain
Synonyms:
TBB5_HUMAN TUBB5 Tubulin beta chain | Tubulin beta-5 chain
Type:
PROTEIN
Mol. Mass.:
49650.12
Organism:
Homo sapiens
Description:
ChEMBL_117191
Residue:
444
  
Inhibitor
Name:
BDBM50014846
Synonyms:
(S)-N-(5,6,7,9-tetrahydro-1,2,3,10-tetramethoxy-9-oxobenzo[a]heptalen-7-yl)acetamide 7alphaH-colchicine COLCHICINE colchicina | colchicinum
Type:
Small organic molecule
Emp. Form.:
C22H25NO6
Mol. Mass.:
399.437
SMILES:
COc1cc2CC[C@H](NC(C)=O)c3cc(=O)c(OC)ccc3-c2c(OC)c1OC
: