Target
Amine oxidase [flavin-containing] B
Ligand
BDBM15579
Substrate
Meas. Tech.
ChEMBL_1715591 (CHEMBL4125640)
IC50
20±n/a nM
Citation
 Ibrar, AShehzadi, SASaeed, FKhan, I Developing hybrid molecule therapeutics for diverse enzyme inhibitory action: Active role of coumarin-based structural leads in drug discovery. Bioorg Med Chem 26:3731-3762 (2018)  
Target
Name:
Amine oxidase [flavin-containing] B
Synonyms:
AOFB_HUMAN MAOB Monoamine oxidase type B (MAO B) Monoamine oxidase type B (MAOB)
Type:
Protein
Mol. Mass.:
58768.76
Organism:
Homo sapiens (Human)
Description:
P27338
Residue:
520
  
Inhibitor
Name:
BDBM15579
Synonyms:
CHEMBL972 L-Deprenyl SLG US8633208, Deprenyl methyl[(2R)-1-phenylpropan-2-yl]prop-2-yn-1-ylamine
Type:
Small organic molecule
Emp. Form.:
C13H17N
Mol. Mass.:
187.2808
SMILES:
C[C@H](Cc1ccccc1)N(C)CC#C
: