Target
Bifunctional purine biosynthesis protein ATIC
Ligand
BDBM50005520
Substrate
Meas. Tech.
ChEMBL_28425 (CHEMBL642468)
IC50
1900±n/a nM
Citation
 Kelley, JLMcLean, EWCohn, NKEdelstein, MPDuch, DSSmith, GKHanlon, MHFerone, R Synthesis and biological activity of an acyclic analogue of 5,6,7,8-tetrahydrofolic acid, N-[4-[[3-(2,4-diamino-1,6-dihydro-6-oxo-5- pyrimidinyl)propyl]amino]-benzoyl]-L-glutamic acid. J Med Chem 33:561-7 (1990)  
Target
Name:
Bifunctional purine biosynthesis protein ATIC
Synonyms:
AICAR transformylase PUR9_MOUSE | Purh
Type:
PROTEIN
Mol. Mass.:
64218.64
Organism:
Mus musculus
Description:
ChEMBL_28425
Residue:
592
  
Inhibitor
Name:
BDBM50005520
Synonyms:
(S)-2-{4-[3-(2,4-Diamino-6-oxo-1,6-dihydro-pyrimidin-5-yl)-propylamino]-benzoylamino}-pentanedioic acid CHEMBL13659
Type:
Small organic molecule
Emp. Form.:
C19H24N6O6
Mol. Mass.:
432.4305
SMILES:
Nc1nc(N)c(CCCNc2ccc(cc2)C(=O)N[C@@H](CCC(O)=O)C(O)=O)c(=O)[nH]1
: