Target
Lymphocyte antigen 96
Ligand
BDBM50277589
Substrate
Meas. Tech.
ChEMBL_1718219 (CHEMBL4133219)
Kd
125000±n/a nM
Citation
 Chen, GXiao, BChen, LBai, BZhang, YXu, ZFu, LLiu, ZLi, XZhao, YLiang, G Discovery of new MD2-targeted anti-inflammatory compounds for the treatment of sepsis and acute lung injury. Eur J Med Chem 139:726-740 (2017)  
Target
Name:
Lymphocyte antigen 96
Synonyms:
ESOP-1 ESOP1 LY96_HUMAN Lymphocyte antigen 96 Protein MD-2 | TLR4-MD2
Type:
PROTEIN
Mol. Mass.:
18551.39
Organism:
Homo sapiens (Human)
Description:
ChEMBL_107939
Residue:
160
  
Inhibitor
Name:
BDBM50277589
Synonyms:
CHEMBL4162528
Type:
Small organic molecule
Emp. Form.:
C18H15BrO2
Mol. Mass.:
343.215
SMILES:
COc1ccccc1\C=C\C(=O)\C=C\c1ccccc1Br
: