Target
Lymphocyte antigen 96
Ligand
BDBM50277590
Substrate
Meas. Tech.
ChEMBL_1718215 (CHEMBL4133215)
IC50
6830±n/a nM
Citation
 Chen, GXiao, BChen, LBai, BZhang, YXu, ZFu, LLiu, ZLi, XZhao, YLiang, G Discovery of new MD2-targeted anti-inflammatory compounds for the treatment of sepsis and acute lung injury. Eur J Med Chem 139:726-740 (2017)  
Target
Name:
Lymphocyte antigen 96
Synonyms:
ESOP-1 ESOP1 LY96_HUMAN Lymphocyte antigen 96 Protein MD-2 | TLR4-MD2
Type:
PROTEIN
Mol. Mass.:
18551.39
Organism:
Homo sapiens (Human)
Description:
ChEMBL_107939
Residue:
160
  
Inhibitor
Name:
BDBM50277590
Synonyms:
CHEMBL4164940
Type:
Small organic molecule
Emp. Form.:
C19H17BrO4
Mol. Mass.:
389.24
SMILES:
COc1cccc(\C=C\C(=O)\C=C\c2ccc(O)c(Br)c2)c1OC
: