Target
Delta(24)-sterol reductase
Ligand
BDBM50278808
Substrate
Meas. Tech.
ChEBML_1719393
IC50
16900±n/a nM
Citation
 Müller, CHemmers, SBartl, NPlodek, AKörner, AMirakaj, VGiera, MBracher, F New chemotype of selective and potent inhibitors of human delta 24-dehydrocholesterol reductase. Eur J Med Chem 140:305-320 (2017)  
Target
Name:
Delta(24)-sterol reductase
Synonyms:
1.3.1.72 3-beta-hydroxysteroid-Delta(8),Delta(7)-isomerase/Delta(24)-sterol reductase DHC24_HUMAN Delta(24)-sterol reductase KIAA0018 | Seladin-1
Type:
PROTEIN
Mol. Mass.:
60115.66
Organism:
Homo sapiens
Description:
ChEMBL_117046
Residue:
516
  
Inhibitor
Name:
BDBM50278808
Synonyms:
CHEMBL4170838
Type:
Small organic molecule
Emp. Form.:
C27H43NO3
Mol. Mass.:
429.6352
SMILES:
[H][C@@]1(CC[C@@]2([H])C3=CC[C@@]4([H])C[C@H](CC[C@]4(C)[C@@]3([H])CC[C@]12C)OC(C)=O)[C@H](C)CNC(=O)CC
: