Target
Potassium voltage-gated channel subfamily H member 2
Ligand
BDBM50279579
Substrate
Meas. Tech.
ChEMBL_1721264 (CHEMBL4136264)
IC50
0.950000±n/a nM
Citation
 Huang, ZLi, HZhang, QLu, FHong, MZhang, ZGuo, XZhu, YLi, SLiu, H Discovery of Indolinone-Based Multikinase Inhibitors as Potential Therapeutics for Idiopathic Pulmonary Fibrosis. ACS Med Chem Lett 8:1142-1147 (2017)  
Target
Name:
Potassium voltage-gated channel subfamily H member 2
Synonyms:
1,3-beta-glucan synthase component GLS2 ERG Eag-related protein 1 Ether-a-go-go-related gene (HERG) Ether-a-go-go-related gene potassium channel 1 Ether-a-go-go-related gene potassium channel 1 (hERG1) Ether-a-go-go-related protein 1 H-ERG KCNH2 Potassium voltage-gated channel subfamily H member 2 (hERG) Voltage-gated potassium channel subunit Kv11.1 hERG Potassium Channel 1 | putative potassium channel subunit
Type:
Multi-pass membrane protein
Mol. Mass.:
126672.65
Organism:
Homo sapiens (Human)
Description:
Q12809
Residue:
1159
  
Inhibitor
Name:
BDBM50279579
Synonyms:
CHEMBL4171244
Type:
Small organic molecule
Emp. Form.:
C33H35N5O4
Mol. Mass.:
565.6621
SMILES:
COC(=O)c1ccc2\C(=C(\Nc3ccc(cc3)N3[C@H](CN4CCN(C)CC4)CCC3=O)c3ccccc3)C(=O)Nc2c1
: