Target
Dihydroorotate dehydrogenase (quinone), mitochondrial
Ligand
BDBM50018011
Substrate
Meas. Tech.
ChEMBL_1722384 (CHEMBL4137384)
IC50
388±n/a nM
Citation
 Sainas, SPippione, ACLupino, EGiorgis, MCircosta, PGaidano, VGoyal, PBonanni, DRolando, BCignetti, ADucime, AAndersson, MJärvå, MFriemann, RPiccinini, MRamondetti, CBuccinnà, BAl-Karadaghi, SBoschi, DSaglio, GLolli, ML Targeting Myeloid Differentiation Using Potent 2-Hydroxypyrazolo[1,5- a]pyridine Scaffold-Based Human Dihydroorotate Dehydrogenase Inhibitors. J Med Chem 61:6034-6055 (2018)  
Target
Name:
Dihydroorotate dehydrogenase (quinone), mitochondrial
Synonyms:
DHODH Dihydroorotate dehydrogenase Dihydroorotate dehydrogenase, mitochondrial Dihydroorotate oxidase (DHODH) | PYRD_HUMAN
Type:
Enzyme
Mol. Mass.:
42881.33
Organism:
Homo sapiens (Human)
Description:
Q02127
Residue:
395
  
Inhibitor
Name:
BDBM50018011
Synonyms:
Aubagio HMR-1726 | TERIFLUNOMIDE
Type:
Small organic molecule
Emp. Form.:
C12H9F3N2O2
Mol. Mass.:
270.2073
SMILES:
C\C(O)=C(/C#N)C(=O)Nc1ccc(cc1)C(F)(F)F
: