Target
Proto-oncogene tyrosine-protein kinase ROS
Ligand
BDBM50306682
Substrate
Meas. Tech.
ChEMBL_1721449 (CHEMBL4136449)
IC50
6.7±n/a nM
Citation
 Wang, YChen, SHu, GWang, JGou, WZuo, DGu, YGong, PZhai, X Discovery of novel 2,4-diarylaminopyrimidine analogues as ALK and ROS1 dual inhibitors to overcome crizotinib-resistant mutants including G1202R. Eur J Med Chem 143:123-136 (2018)  
Target
Name:
Proto-oncogene tyrosine-protein kinase ROS
Synonyms:
MCF3 Proto-oncogene c-Ros-1 ROS1 Receptor tyrosine kinase c-ros oncogene 1 c-Ros receptor tyrosine kinase
Type:
Enzyme
Mol. Mass.:
263897.39
Organism:
Homo sapiens (Human)
Description:
P08922
Residue:
2347
  
Inhibitor
Name:
BDBM50306682
Synonyms:
(R)-3-(1-(2,6-dichloro-3-fluorophenyl)ethoxy)-5-(1-(piperidin-4-yl)-1H-pyrazol-4-yl)pyridin-2-amine 3-[(1R)-1-(2,6-dichloro-3-fluorophenyl)ethoxy]-5-(1-piperidin-4-yl-1H-pyrazol-4-yl)pyridin-2-amine CRIZOTINIB US10370379, Crizotinib US10780082, Compound Crizotinib US11517561, Compound Crizotinib US9199944, Crizotinib | US9226923, Crizotinib
Type:
Small organic molecule
Emp. Form.:
C21H22Cl2FN5O
Mol. Mass.:
450.337
SMILES:
C[C@@H](Oc1cc(cnc1N)-c1cnn(c1)C1CCNCC1)c1c(Cl)ccc(F)c1Cl
: