Target
DNA (cytosine-5)-methyltransferase 1
Ligand
BDBM50424715
Substrate
Meas. Tech.
ChEMBL_1722467 (CHEMBL4137467)
IC50
300±n/a nM
Citation
 Rabal, OSan José-Enériz, EAgirre, XSánchez-Arias, JAVilas-Zornoza, AUgarte, Ade Miguel, IMiranda, EGarate, LFraga, MSantamarina, PFernandez Perez, ROrdoñez, RSáez, ERoa, SGarcía-Barchino, MJMartínez-Climent, JALiu, YWu, WXu, MProsper, FOyarzabal, J Discovery of Reversible DNA Methyltransferase and Lysine Methyltransferase G9a Inhibitors with Antitumoral in Vivo Efficacy. J Med Chem 61:6518-6545 (2018)  
Target
Name:
DNA (cytosine-5)-methyltransferase 1
Synonyms:
AIM CXXC9 DNA (cytosine-5)-methyltransferase 1 isoform b DNA methyltransferase HsaI DNMT1 M.HsaI | MCMT
Type:
Enzyme
Mol. Mass.:
183184.85
Organism:
Homo sapiens (Human)
Description:
P26358
Residue:
1616
  
Inhibitor
Name:
BDBM50424715
Synonyms:
AZACITIDINE Ladakamycin Vidaza
Type:
Small organic molecule
Emp. Form.:
C8H12N4O5
Mol. Mass.:
244.2047
SMILES:
Nc1ncn([C@@H]2O[C@H](CO)[C@@H](O)[C@H]2O)c(=O)n1
: