Target
Chromobox protein homolog 7
Ligand
BDBM50194463
Substrate
Meas. Tech.
ChEMBL_1723530 (CHEMBL4138808)
Kd
6700±n/a nM
Citation
 Teske, KAHadden, MK Methyllysine binding domains: Structural insight and small molecule probe development. Eur J Med Chem 136:14-35 (2017)  
Target
Name:
Chromobox protein homolog 7
Synonyms:
CBX7 Chromobox protein homolog 7 | Chromobox protein homolog 7 (CBX7)
Type:
Protein
Mol. Mass.:
28351.76
Organism:
Homo sapiens (Human)
Description:
Residue:
251
  
Inhibitor
Name:
BDBM50194463
Synonyms:
CHEMBL3974828
Type:
Small organic molecule
Emp. Form.:
C41H61N7O9
Mol. Mass.:
795.9645
SMILES:
CCN(CC)CCCC[C@H](NC(=O)[C@H](CC(C)C)NC(=O)[C@H](C)NC(=O)[C@H](Cc1ccccc1)NC(=O)CNC(=O)c1ccccc1)C(=O)N[C@@H](CO)C(=O)OC
: