Target
Chromobox protein homolog 7
Ligand
BDBM50282168
Substrate
Meas. Tech.
ChEMBL_1723530 (CHEMBL4138808)
Kd
5000±n/a nM
Citation
 Teske, KAHadden, MK Methyllysine binding domains: Structural insight and small molecule probe development. Eur J Med Chem 136:14-35 (2017)  
Target
Name:
Chromobox protein homolog 7
Synonyms:
CBX7 Chromobox protein homolog 7 | Chromobox protein homolog 7 (CBX7)
Type:
Protein
Mol. Mass.:
28351.76
Organism:
Homo sapiens (Human)
Description:
Residue:
251
  
Inhibitor
Name:
BDBM50282168
Synonyms:
CHEMBL4175216
Type:
Small organic molecule
Emp. Form.:
C58H89N16O14
Mol. Mass.:
1234.4255
SMILES:
COC(=O)CNC(=O)[C@H](Cc1cnc[nH]1)NC(=O)[C@@H](NC(=O)[C@H](CO)NC(=O)[C@H](CCCC[N+](C)(C)C)NC(=O)[C@H](CC(C)C)NC(=O)[C@H](C)NC(=O)[C@H](Cc1ccccc1)NC(=O)CNC(=O)[C@H](CCCNC(N)=N)NC(=O)c1ccccc1)[C@@H](C)O
: