Target
Adenosine receptor A2b
Ligand
BDBM50282636
Substrate
Meas. Tech.
ChEMBL_1724453 (CHEMBL4139731)
EC50
35±n/a nM
Citation
 Paz, OSde Jesus Pinheiro, Mdo Espirito Santo, RFVillarreal, CFCastilho, MS Nanomolar anti-sickling compounds identified by ligand-based pharmacophore approach. Eur J Med Chem 136:487-496 (2017)  
Target
Name:
Adenosine receptor A2b
Synonyms:
AA2BR_HUMAN ADORA2B Adenosine receptors A2b | Adenosine receptors; A2a & A2b
Type:
G Protein-Coupled Receptor (GPCR)
Mol. Mass.:
36341.22
Organism:
Homo sapiens (Human)
Description:
Residue:
332
  
Inhibitor
Name:
BDBM50282636
Synonyms:
CHEMBL4163380
Type:
Small organic molecule
Emp. Form.:
C13H11F2N3O4
Mol. Mass.:
311.2409
SMILES:
Cc1cc(NC(=O)CNc2ccc3OC(F)(F)Oc3c2)on1
: