Target
Potassium voltage-gated channel subfamily H member 2
Ligand
BDBM50287558
Substrate
Meas. Tech.
ChEMBL_1729718 (CHEMBL4144996)
Ki
>40000±n/a nM
Citation
 Sammons, MFKharade, SVFilipski, KJBoehm, MSmith, ACShavnya, AFernando, DPDowling, MSCarpino, PACastle, NAZellmer, SGAntonio, BMGosset, JRCarlo, ADenton, JS Discovery and in Vitro Optimization of 3-Sulfamoylbenzamides as ROMK Inhibitors. ACS Med Chem Lett 9:125-130 (2018)  
Target
Name:
Potassium voltage-gated channel subfamily H member 2
Synonyms:
1,3-beta-glucan synthase component GLS2 ERG Eag-related protein 1 Ether-a-go-go-related gene (HERG) Ether-a-go-go-related gene potassium channel 1 Ether-a-go-go-related gene potassium channel 1 (hERG1) Ether-a-go-go-related protein 1 H-ERG KCNH2 Potassium voltage-gated channel subfamily H member 2 (hERG) Voltage-gated potassium channel subunit Kv11.1 hERG Potassium Channel 1 | putative potassium channel subunit
Type:
Multi-pass membrane protein
Mol. Mass.:
126672.65
Organism:
Homo sapiens (Human)
Description:
Q12809
Residue:
1159
  
Inhibitor
Name:
BDBM50287558
Synonyms:
CHEMBL1333494
Type:
Small organic molecule
Emp. Form.:
C21H21N3O3S
Mol. Mass.:
395.475
SMILES:
Cc1ccc(NS(=O)(=O)c2cc(ccc2C)C(=O)NCc2cccnc2)cc1
: