Target
Beta-1 adrenergic receptor
Ligand
BDBM25753
Substrate
Meas. Tech.
ChEMBL_1729838 (CHEMBL4145116)
Ki
1514±n/a nM
Citation
 Nocentini, ACeruso, MBua, SLomelino, CLAndring, JTMcKenna, RLanzi, CSgambellone, SPecori, RMatucci, RFilippi, LGratteri, PCarta, FMasini, ESelleri, SSupuran, CT Discovery of ?-Adrenergic Receptors Blocker-Carbonic Anhydrase Inhibitor Hybrids for Multitargeted Antiglaucoma Therapy. J Med Chem 61:5380-5394 (2018)  
Target
Name:
Beta-1 adrenergic receptor
Synonyms:
ADRB1 ADRB1_HUMAN Beta-1 adrenoceptor | adrenergic Beta1
Type:
G Protein-Coupled Receptor (GPCR)
Mol. Mass.:
51338.40
Organism:
Homo sapiens (Human)
Description:
P08588
Residue:
477
  
Inhibitor
Name:
BDBM25753
Synonyms:
2-{4-[2-hydroxy-3-(propan-2-ylamino)propoxy]phenyl}acetamide Atenolol Tenormin | Tenormine
Type:
Small organic molecule
Emp. Form.:
C14H22N2O3
Mol. Mass.:
266.3361
SMILES:
CC(C)NCC(O)COc1ccc(CC(N)=O)cc1
: