Target
Protease
Ligand
BDBM50288363
Substrate
Meas. Tech.
ChEMBL_1729848 (CHEMBL4145126)
EC50
0.300000±n/a nM
Citation
 Hidaka, KKimura, TSankaranarayanan, RWang, JMcDaniel, KFKempf, DJKameoka, MAdachi, MKuroki, RNguyen, JTHayashi, YKiso, Y Identification of Highly Potent Human Immunodeficiency Virus Type-1 Protease Inhibitors against Lopinavir and Darunavir Resistant Viruses from Allophenylnorstatine-Based Peptidomimetics with P2 Tetrahydrofuranylglycine. J Med Chem 61:5138-5153 (2018)  
Target
Name:
Protease
Synonyms:
Type:
Enzyme
Mol. Mass.:
10904.79
Organism:
Human immunodeficiency virus 1 (HIV-1)
Description:
Q9YQ12
Residue:
99
  
Inhibitor
Name:
BDBM50288363
Synonyms:
CHEMBL4173216
Type:
Small organic molecule
Emp. Form.:
C41H48N4O8S
Mol. Mass.:
756.907
SMILES:
[H][C@@](NC(=O)c1cc2cccc(OC)c2o1)(C(=O)N[C@@H](Cc1ccccc1)[C@H](O)C(=O)N1CSC(C)(C)[C@H]1C(=O)NCc1c(C)cccc1C)[C@@]1([H])CCOC1
: