Target
Tyrosine-protein kinase JAK1
Ligand
BDBM50288511
Substrate
Meas. Tech.
ChEMBL_1729905 (CHEMBL4145183)
IC50
<3.0±n/a nM
Citation
 Grimster, NPAnderson, EAlimzhanov, MBebernitz, GBell, KChuaqui, CDeegan, TFerguson, ADGero, THarsch, AHuszar, DKawatkar, AKettle, JGLyne, PRead, JARivard Costa, CRuston, LSchroeder, PShi, JSu, QThroner, SToader, DVasbinder, MWoessner, RWang, HWu, AYe, MZheng, WZinda, M Discovery and Optimization of a Novel Series of Highly Selective JAK1 Kinase Inhibitors. J Med Chem 61:5235-5244 (2018)  
Target
Name:
Tyrosine-protein kinase JAK1
Synonyms:
JAK-1 JAK1A JAK1_HUMAN Janus kinase 1 (JAK1) | Janus kinase 1 JAK1
Type:
Protein
Mol. Mass.:
133293.73
Organism:
Homo sapiens (Human)
Description:
P23458
Residue:
1154
  
Inhibitor
Name:
BDBM50288511
Synonyms:
CHEMBL4171692
Type:
Small organic molecule
Emp. Form.:
C24H30N6O3S
Mol. Mass.:
482.598
SMILES:
CN1CCN(CC1)c1cc(Nc2ncc(C)c(Nc3cccc(CO)c3)n2)cc(c1)S(C)(=O)=O
: