Target
Glucose-6-phosphate 1-dehydrogenase
Ligand
BDBM50292582
Substrate
Meas. Tech.
ChEMBL_1731846 (CHEMBL4147382)
Ki
16800±n/a nM
Citation
 Alencar, NSola, ILinares, MJuárez-Jiménez, JPont, CViayna, AVílchez, DSampedro, CAbad, PPérez-Benavente, SLameira, JBautista, JMMuñoz-Torrero, DLuque, FJ First homology model of Plasmodium falciparum glucose-6-phosphate dehydrogenase: Discovery of selective substrate analog-based inhibitors as novel antimalarial agents. Eur J Med Chem 146:108-122 (2018)  
Target
Name:
Glucose-6-phosphate 1-dehydrogenase
Synonyms:
G6PD Glucose 6-phosphate dehydrogenase (G6PD) glucose-6-phosphate 1-dehydrogenase isoform b
Type:
Enzyme
Mol. Mass.:
59258.58
Organism:
Homo sapiens (Human)
Description:
P11413
Residue:
515
  
Inhibitor
Name:
BDBM50292582
Synonyms:
CHEMBL4162427
Type:
Small organic molecule
Emp. Form.:
C10H22N4O7S
Mol. Mass.:
342.369
SMILES:
CO[C@H]1O[C@H](CNS(=O)(=O)CCNC(N)=N)[C@@H](O)[C@H](O)[C@H]1O
: